{"text_format":"1","workbook":"xlsx","n_sheets":7,"sheets":["43","44","45","46","47","48","記録"],"not_rendered":{"charts":0,"images":0,"macros":1,"external_links":0,"defined_names":3,"comments":0,"pivot_tables":0},"unopened":[],"bounds":{"document_bytes":16777216,"sheet_cells":100000,"rows_first":2000,"rows_last":500,"rows_between":2000,"halvings":0,"cell_chars":16384,"cell_head_chars":4096},"cells_cut":0,"cells_raw":0,"read":"whole","date_system":"1900"}

{"sheet":"43","index":0,"n_rows":60,"n_cols":27,"rows_kept":60,"cut":false,"hidden":true,"merged":[[16,9,16,11],[17,9,17,11],[18,9,18,10],[10,6,10,8],[2,25,2,26],[7,24,13,24],[10,9,10,11],[3,9,4,9],[3,10,4,10],[3,11,4,11],[7,23,13,23],[7,21,13,21],[7,22,13,22],[2,20,2,23],[5,7,5,8],[7,6,7,7],[10,1,11,1],[10,3,11,3],[10,4,11,4],[10,5,11,5],[7,4,7,5]]}
[null,null,null,null,null,null,null,null,null,"No."]
[]
[null,null,"第64回東海高等学校総合体育大会ボート競技","第64回東海高等学校総合体育大会ボート競技",null,null,null,null,null,"競　漕　委員長","審判長","主　席　判定員",null,null,null,null,null,null,null,null,"東海総体",null,null,null,null,"2013-06-15"]
[null,null,"平成29年6月１7日（土）","平成29年6月18日（日）",null,null,null,null,null,null,null,null,null,null,null,null,null,null,null,null,"レースNo","発艇時刻","クラス","種目","区分",null,"上がり"]
[null,null,null,null,null,null,null,null,null,null,null,null,null,null,null,null,null,null,null,null,{"$f":"+D6","v":43},{"$f":"+H6","v":{"$error":"#REF!"}},{"$f":"+D9","v":{"$error":"#REF!"}},{"$f":"+F9","v":{"$error":"#REF!"}},{"$f":"+G9","v":{"$error":"#REF!"}},{"$f":"+H9","v":{"$error":"#REF!"}},{"$f":"+L9","v":0}]
[null,"レースNo.",null,43,null,"発艇",null,{"$f":"+VLOOKUP(D6,#REF!,2)","v":{"$error":"#REF!"}}]
[null,null,null,null,null,null,null,null,null,null,null,null,null,null,null,null,null,null,null,null,null,4,3,2,1]
[null,null,null,"参加区分","種目",null,"区分",null,"距離",null,"使用レーン数",4,null,null,null,null,null,null,null,null,null,{"$f":"IF(E16=0,\"\",E16)","v":""},{"$f":"IF(E15=0,\"\",E15)","v":""},{"$f":"IF(E14=0,\"\",E14)","v":""},{"$f":"IF(E13=0,\"\",E13)","v":""}]
[null,null,null,{"$f":"+LEFT(VLOOKUP(D6,競漕日程,3),2)","v":{"$error":"#REF!"}},{"$f":"+VLOOKUP(D6,競漕日程,5)","v":{"$error":"#REF!"}},{"$f":"VLOOKUP(E9,E57:F60,2)","v":{"$error":"#REF!"}},{"$f":"+VLOOKUP(D6,競漕日程,6)","v":{"$error":"#REF!"}},{"$f":"+VLOOKUP(D6,競漕日程,7)","v":{"$error":"#REF!"}},"1000m",null,"上がり数"]
[]
[null,"レーン番号",null,"県名","クルー名","着順","ゴールタイム"]
[null,null,null,null,null,null,"分","秒"]
[null,1,4,{"$f":"IF(ISERROR(VLOOKUP(C13,#REF!,2,FALSE)),\"\",VLOOKUP(C13,#REF!,2,FALSE))","v":""},{"$f":"IF(ISERROR(VLOOKUP(C13,#REF!,3,FALSE)),\"\",VLOOKUP(C13,#REF!,3,FALSE))","v":""}]
[null,2,2,{"$f":"IF(ISERROR(VLOOKUP(C14,#REF!,2,FALSE)),\"\",VLOOKUP(C14,#REF!,2,FALSE))","v":""},{"$f":"IF(ISERROR(VLOOKUP(C14,#REF!,3,FALSE)),\"\",VLOOKUP(C14,#REF!,3,FALSE))","v":""}]
[null,3,1,{"$f":"IF(ISERROR(VLOOKUP(C15,#REF!,2,FALSE)),\"\",VLOOKUP(C15,#REF!,2,FALSE))","v":""},{"$f":"IF(ISERROR(VLOOKUP(C15,#REF!,3,FALSE)),\"\",VLOOKUP(C15,#REF!,3,FALSE))","v":""}]
[null,4,3,{"$f":"IF(ISERROR(VLOOKUP(C16,#REF!,2,FALSE)),\"\",VLOOKUP(C16,#REF!,2,FALSE))","v":""},{"$f":"IF(ISERROR(VLOOKUP(C16,#REF!,3,FALSE)),\"\",VLOOKUP(C16,#REF!,3,FALSE))","v":""}]
[null,null,null,null,null,null,null,null,"天候"]
[null,"備考",null,null,null,null,null,null,"風向"]
[null,null,null,null,null,null,null,null,"風速",null,null,"m/秒",null,null,null,null,null,"記録用紙印刷　　ctrl+y"]
[null,null,null,null,null,null,null,null,null,null,null,null,null,null,null,null,null,"審判用用紙印刷　ctrl+g"]
[]
[]
[]
[]
[]
[]
[]
[null,null,null,null,null,null,null,{"$f":"PHONETIC(E16)","v":""},{"$f":"PHONETIC(E15)","v":""},{"$f":"PHONETIC(E14)","v":""},{"$f":"PHONETIC(E13)","v":""}]
[]
[]
[]
[]
[]
[]
[]
[]
[]
[]
[]
[]
{"$rows_left_out":21}
{"sheet":"44","index":1,"n_rows":60,"n_cols":27,"rows_kept":60,"cut":false,"hidden":true,"merged":[[16,9,16,11],[17,9,17,11],[18,9,18,10],[10,6,10,8],[2,25,2,26],[7,24,13,24],[10,9,10,11],[3,9,4,9],[3,10,4,10],[3,11,4,11],[7,23,13,23],[7,21,13,21],[7,22,13,22],[2,20,2,23],[5,7,5,8],[7,6,7,7],[10,1,11,1],[10,3,11,3],[10,4,11,4],[10,5,11,5],[7,4,7,5]]}
[null,null,null,null,null,null,null,null,null,"No."]
[]
[null,null,"第64回東海高等学校総合体育大会ボート競技","第64回東海高等学校総合体育大会ボート競技",null,null,null,null,null,"競　漕　委員長","審判長","主　席　判定員",null,null,null,null,null,null,null,null,"東海総体",null,null,null,null,"2013-06-15"]
[null,null,"平成29年6月１7日（土）","平成29年6月18日（日）",null,null,null,null,null,null,null,null,null,null,null,null,null,null,null,null,"レースNo","発艇時刻","クラス","種目","区分",null,"上がり"]
[null,null,null,null,null,null,null,null,null,null,null,null,null,null,null,null,null,null,null,null,{"$f":"+D6","v":44},{"$f":"+H6","v":{"$error":"#REF!"}},{"$f":"+D9","v":{"$error":"#REF!"}},{"$f":"+F9","v":{"$error":"#REF!"}},{"$f":"+G9","v":{"$error":"#REF!"}},{"$f":"+H9","v":{"$error":"#REF!"}},{"$f":"+L9","v":0}]
[null,"レースNo.",null,44,null,"発艇",null,{"$f":"+VLOOKUP(D6,#REF!,2)","v":{"$error":"#REF!"}}]
[null,null,null,null,null,null,null,null,null,null,null,null,null,null,null,null,null,null,null,null,null,4,3,2,1]
[null,null,null,"参加区分","種目",null,"区分",null,"距離",null,"使用レーン数",4,null,null,null,null,null,null,null,null,null,{"$f":"IF(E16=0,\"\",E16)","v":""},{"$f":"IF(E15=0,\"\",E15)","v":""},{"$f":"IF(E14=0,\"\",E14)","v":""},{"$f":"IF(E13=0,\"\",E13)","v":""}]
[null,null,null,{"$f":"+LEFT(VLOOKUP(D6,競漕日程,3),2)","v":{"$error":"#REF!"}},{"$f":"+VLOOKUP(D6,競漕日程,5)","v":{"$error":"#REF!"}},{"$f":"VLOOKUP(E9,E57:F60,2)","v":{"$error":"#REF!"}},{"$f":"+VLOOKUP(D6,競漕日程,6)","v":{"$error":"#REF!"}},{"$f":"+VLOOKUP(D6,競漕日程,7)","v":{"$error":"#REF!"}},"1000m",null,"上がり数"]
[]
[null,"レーン番号",null,"県名","クルー名","着順","ゴールタイム"]
[null,null,null,null,null,null,"分","秒"]
[null,1,4,{"$f":"IF(ISERROR(VLOOKUP(C13,#REF!,2,FALSE)),\"\",VLOOKUP(C13,#REF!,2,FALSE))","v":""},{"$f":"IF(ISERROR(VLOOKUP(C13,#REF!,3,FALSE)),\"\",VLOOKUP(C13,#REF!,3,FALSE))","v":""}]
[null,2,2,{"$f":"IF(ISERROR(VLOOKUP(C14,#REF!,2,FALSE)),\"\",VLOOKUP(C14,#REF!,2,FALSE))","v":""},{"$f":"IF(ISERROR(VLOOKUP(C14,#REF!,3,FALSE)),\"\",VLOOKUP(C14,#REF!,3,FALSE))","v":""}]
[null,3,1,{"$f":"IF(ISERROR(VLOOKUP(C15,#REF!,2,FALSE)),\"\",VLOOKUP(C15,#REF!,2,FALSE))","v":""},{"$f":"IF(ISERROR(VLOOKUP(C15,#REF!,3,FALSE)),\"\",VLOOKUP(C15,#REF!,3,FALSE))","v":""}]
[null,4,3,{"$f":"IF(ISERROR(VLOOKUP(C16,#REF!,2,FALSE)),\"\",VLOOKUP(C16,#REF!,2,FALSE))","v":""},{"$f":"IF(ISERROR(VLOOKUP(C16,#REF!,3,FALSE)),\"\",VLOOKUP(C16,#REF!,3,FALSE))","v":""}]
[null,null,null,null,null,null,null,null,"天候"]
[null,"備考",null,null,null,null,null,null,"風向"]
[null,null,null,null,null,null,null,null,"風速",null,null,"m/秒",null,null,null,null,null,"記録用紙印刷　　ctrl+y"]
[null,null,null,null,null,null,null,null,null,null,null,null,null,null,null,null,null,"審判用用紙印刷　ctrl+g"]
[]
[]
[]
[]
[]
[]
[]
[null,null,null,null,null,null,null,{"$f":"PHONETIC(E16)","v":""},{"$f":"PHONETIC(E15)","v":""},{"$f":"PHONETIC(E14)","v":""},{"$f":"PHONETIC(E13)","v":""}]
[]
[]
[]
[]
[]
[]
[]
[]
[]
[]
[]
[]
{"$rows_left_out":21}
{"sheet":"45","index":2,"n_rows":60,"n_cols":27,"rows_kept":60,"cut":false,"hidden":true,"merged":[[16,9,16,11],[17,9,17,11],[18,9,18,10],[10,6,10,8],[2,25,2,26],[7,24,13,24],[10,9,10,11],[3,9,4,9],[3,10,4,10],[3,11,4,11],[7,23,13,23],[7,21,13,21],[7,22,13,22],[2,20,2,23],[5,7,5,8],[7,6,7,7],[10,1,11,1],[10,3,11,3],[10,4,11,4],[10,5,11,5],[7,4,7,5]]}
[null,null,null,null,null,null,null,null,null,"No."]
[]
[null,null,"第64回東海高等学校総合体育大会ボート競技","第64回東海高等学校総合体育大会ボート競技",null,null,null,null,null,"競　漕　委員長","審判長","主　席　判定員",null,null,null,null,null,null,null,null,"東海総体",null,null,null,null,"2013-06-15"]
[null,null,"平成29年6月１7日（土）","平成29年6月18日（日）",null,null,null,null,null,null,null,null,null,null,null,null,null,null,null,null,"レースNo","発艇時刻","クラス","種目","区分",null,"上がり"]
[null,null,null,null,null,null,null,null,null,null,null,null,null,null,null,null,null,null,null,null,{"$f":"+D6","v":45},{"$f":"+H6","v":{"$error":"#REF!"}},{"$f":"+D9","v":{"$error":"#REF!"}},{"$f":"+F9","v":{"$error":"#REF!"}},{"$f":"+G9","v":{"$error":"#REF!"}},{"$f":"+H9","v":{"$error":"#REF!"}},{"$f":"+L9","v":0}]
[null,"レースNo.",null,45,null,"発艇",null,{"$f":"+VLOOKUP(D6,#REF!,2)","v":{"$error":"#REF!"}}]
[null,null,null,null,null,null,null,null,null,null,null,null,null,null,null,null,null,null,null,null,null,4,3,2,1]
[null,null,null,"参加区分","種目",null,"区分",null,"距離",null,"使用レーン数",4,null,null,null,null,null,null,null,null,null,{"$f":"IF(E16=0,\"\",E16)","v":""},{"$f":"IF(E15=0,\"\",E15)","v":""},{"$f":"IF(E14=0,\"\",E14)","v":""},{"$f":"IF(E13=0,\"\",E13)","v":""}]
[null,null,null,{"$f":"+LEFT(VLOOKUP(D6,競漕日程,3),2)","v":{"$error":"#REF!"}},{"$f":"+VLOOKUP(D6,競漕日程,5)","v":{"$error":"#REF!"}},{"$f":"VLOOKUP(E9,E57:F60,2)","v":{"$error":"#REF!"}},{"$f":"+VLOOKUP(D6,競漕日程,6)","v":{"$error":"#REF!"}},{"$f":"+VLOOKUP(D6,競漕日程,7)","v":{"$error":"#REF!"}},"1000m",null,"上がり数"]
[]
[null,"レーン番号",null,"県名","クルー名","着順","ゴールタイム"]
[null,null,null,null,null,null,"分","秒"]
[null,1,4,{"$f":"IF(ISERROR(VLOOKUP(C13,#REF!,2,FALSE)),\"\",VLOOKUP(C13,#REF!,2,FALSE))","v":""},{"$f":"IF(ISERROR(VLOOKUP(C13,#REF!,3,FALSE)),\"\",VLOOKUP(C13,#REF!,3,FALSE))","v":""}]
[null,2,2,{"$f":"IF(ISERROR(VLOOKUP(C14,#REF!,2,FALSE)),\"\",VLOOKUP(C14,#REF!,2,FALSE))","v":""},{"$f":"IF(ISERROR(VLOOKUP(C14,#REF!,3,FALSE)),\"\",VLOOKUP(C14,#REF!,3,FALSE))","v":""}]
[null,3,1,{"$f":"IF(ISERROR(VLOOKUP(C15,#REF!,2,FALSE)),\"\",VLOOKUP(C15,#REF!,2,FALSE))","v":""},{"$f":"IF(ISERROR(VLOOKUP(C15,#REF!,3,FALSE)),\"\",VLOOKUP(C15,#REF!,3,FALSE))","v":""}]
[null,4,3,{"$f":"IF(ISERROR(VLOOKUP(C16,#REF!,2,FALSE)),\"\",VLOOKUP(C16,#REF!,2,FALSE))","v":""},{"$f":"IF(ISERROR(VLOOKUP(C16,#REF!,3,FALSE)),\"\",VLOOKUP(C16,#REF!,3,FALSE))","v":""}]
[null,null,null,null,null,null,null,null,"天候"]
[null,"備考",null,null,null,null,null,null,"風向"]
[null,null,null,null,null,null,null,null,"風速",null,null,"m/秒",null,null,null,null,null,"記録用紙印刷　　ctrl+y"]
[null,null,null,null,null,null,null,null,null,null,null,null,null,null,null,null,null,"審判用用紙印刷　ctrl+g"]
[]
[]
[]
[]
[]
[]
[]
[null,null,null,null,null,null,null,{"$f":"PHONETIC(E16)","v":""},{"$f":"PHONETIC(E15)","v":""},{"$f":"PHONETIC(E14)","v":""},{"$f":"PHONETIC(E13)","v":""}]
[]
[]
[]
[]
[]
[]
[]
[]
[]
[]
[]
[]
{"$rows_left_out":21}
{"sheet":"46","index":3,"n_rows":60,"n_cols":27,"rows_kept":60,"cut":false,"hidden":true,"merged":[[16,9,16,11],[17,9,17,11],[18,9,18,10],[10,6,10,8],[2,25,2,26],[7,24,13,24],[10,9,10,11],[3,9,4,9],[3,10,4,10],[3,11,4,11],[7,23,13,23],[7,21,13,21],[7,22,13,22],[2,20,2,23],[5,7,5,8],[7,6,7,7],[10,1,11,1],[10,3,11,3],[10,4,11,4],[10,5,11,5],[7,4,7,5]]}
[null,null,null,null,null,null,null,null,null,"No."]
[]
[null,null,"第64回東海高等学校総合体育大会ボート競技","第64回東海高等学校総合体育大会ボート競技",null,null,null,null,null,"競　漕　委員長","審判長","主　席　判定員",null,null,null,null,null,null,null,null,"東海総体",null,null,null,null,"2013-06-15"]
[null,null,"平成29年6月１7日（土）","平成29年6月18日（日）",null,null,null,null,null,null,null,null,null,null,null,null,null,null,null,null,"レースNo","発艇時刻","クラス","種目","区分",null,"上がり"]
[null,null,null,null,null,null,null,null,null,null,null,null,null,null,null,null,null,null,null,null,{"$f":"+D6","v":46},{"$f":"+H6","v":{"$error":"#REF!"}},{"$f":"+D9","v":{"$error":"#REF!"}},{"$f":"+F9","v":{"$error":"#REF!"}},{"$f":"+G9","v":{"$error":"#REF!"}},{"$f":"+H9","v":{"$error":"#REF!"}},{"$f":"+L9","v":0}]
[null,"レースNo.",null,46,null,"発艇",null,{"$f":"+VLOOKUP(D6,#REF!,2)","v":{"$error":"#REF!"}}]
[null,null,null,null,null,null,null,null,null,null,null,null,null,null,null,null,null,null,null,null,null,4,3,2,1]
[null,null,null,"参加区分","種目",null,"区分",null,"距離",null,"使用レーン数",4,null,null,null,null,null,null,null,null,null,{"$f":"IF(E16=0,\"\",E16)","v":""},{"$f":"IF(E15=0,\"\",E15)","v":""},{"$f":"IF(E14=0,\"\",E14)","v":""},{"$f":"IF(E13=0,\"\",E13)","v":""}]
[null,null,null,{"$f":"+LEFT(VLOOKUP(D6,競漕日程,3),2)","v":{"$error":"#REF!"}},{"$f":"+VLOOKUP(D6,競漕日程,5)","v":{"$error":"#REF!"}},{"$f":"VLOOKUP(E9,E57:F60,2)","v":{"$error":"#REF!"}},{"$f":"+VLOOKUP(D6,競漕日程,6)","v":{"$error":"#REF!"}},{"$f":"+VLOOKUP(D6,競漕日程,7)","v":{"$error":"#REF!"}},"1000m",null,"上がり数"]
[]
[null,"レーン番号",null,"県名","クルー名","着順","ゴールタイム"]
[null,null,null,null,null,null,"分","秒"]
[null,1,4,{"$f":"IF(ISERROR(VLOOKUP(C13,#REF!,2,FALSE)),\"\",VLOOKUP(C13,#REF!,2,FALSE))","v":""},{"$f":"IF(ISERROR(VLOOKUP(C13,#REF!,3,FALSE)),\"\",VLOOKUP(C13,#REF!,3,FALSE))","v":""}]
[null,2,2,{"$f":"IF(ISERROR(VLOOKUP(C14,#REF!,2,FALSE)),\"\",VLOOKUP(C14,#REF!,2,FALSE))","v":""},{"$f":"IF(ISERROR(VLOOKUP(C14,#REF!,3,FALSE)),\"\",VLOOKUP(C14,#REF!,3,FALSE))","v":""}]
[null,3,1,{"$f":"IF(ISERROR(VLOOKUP(C15,#REF!,2,FALSE)),\"\",VLOOKUP(C15,#REF!,2,FALSE))","v":""},{"$f":"IF(ISERROR(VLOOKUP(C15,#REF!,3,FALSE)),\"\",VLOOKUP(C15,#REF!,3,FALSE))","v":""}]
[null,4,3,{"$f":"IF(ISERROR(VLOOKUP(C16,#REF!,2,FALSE)),\"\",VLOOKUP(C16,#REF!,2,FALSE))","v":""},{"$f":"IF(ISERROR(VLOOKUP(C16,#REF!,3,FALSE)),\"\",VLOOKUP(C16,#REF!,3,FALSE))","v":""}]
[null,null,null,null,null,null,null,null,"天候"]
[null,"備考",null,null,null,null,null,null,"風向"]
[null,null,null,null,null,null,null,null,"風速",null,null,"m/秒",null,null,null,null,null,"記録用紙印刷　　ctrl+y"]
[null,null,null,null,null,null,null,null,null,null,null,null,null,null,null,null,null,"審判用用紙印刷　ctrl+g"]
[]
[]
[]
[]
[]
[]
[]
[null,null,null,null,null,null,null,{"$f":"PHONETIC(E16)","v":""},{"$f":"PHONETIC(E15)","v":""},{"$f":"PHONETIC(E14)","v":""},{"$f":"PHONETIC(E13)","v":""}]
[]
[]
[]
[]
[]
[]
[]
[]
[]
[]
[]
[]
{"$rows_left_out":21}
{"sheet":"47","index":4,"n_rows":60,"n_cols":27,"rows_kept":60,"cut":false,"hidden":true,"merged":[[16,9,16,11],[17,9,17,11],[18,9,18,10],[10,6,10,8],[2,25,2,26],[7,24,13,24],[10,9,10,11],[3,9,4,9],[3,10,4,10],[3,11,4,11],[7,23,13,23],[7,21,13,21],[7,22,13,22],[2,20,2,23],[5,7,5,8],[7,6,7,7],[10,1,11,1],[10,3,11,3],[10,4,11,4],[10,5,11,5],[7,4,7,5]]}
[null,null,null,null,null,null,null,null,null,"No."]
[]
[null,null,"第64回東海高等学校総合体育大会ボート競技","第64回東海高等学校総合体育大会ボート競技",null,null,null,null,null,"競　漕　委員長","審判長","主　席　判定員",null,null,null,null,null,null,null,null,"東海総体",null,null,null,null,"2013-06-15"]
[null,null,"平成29年6月１7日（土）","平成29年6月18日（日）",null,null,null,null,null,null,null,null,null,null,null,null,null,null,null,null,"レースNo","発艇時刻","クラス","種目","区分",null,"上がり"]
[null,null,null,null,null,null,null,null,null,null,null,null,null,null,null,null,null,null,null,null,{"$f":"+D6","v":47},{"$f":"+H6","v":{"$error":"#REF!"}},{"$f":"+D9","v":{"$error":"#REF!"}},{"$f":"+F9","v":{"$error":"#REF!"}},{"$f":"+G9","v":{"$error":"#REF!"}},{"$f":"+H9","v":{"$error":"#REF!"}},{"$f":"+L9","v":0}]
[null,"レースNo.",null,47,null,"発艇",null,{"$f":"+VLOOKUP(D6,#REF!,2)","v":{"$error":"#REF!"}}]
[null,null,null,null,null,null,null,null,null,null,null,null,null,null,null,null,null,null,null,null,null,4,3,2,1]
[null,null,null,"参加区分","種目",null,"区分",null,"距離",null,"使用レーン数",4,null,null,null,null,null,null,null,null,null,{"$f":"IF(E16=0,\"\",E16)","v":""},{"$f":"IF(E15=0,\"\",E15)","v":""},{"$f":"IF(E14=0,\"\",E14)","v":""},{"$f":"IF(E13=0,\"\",E13)","v":""}]
[null,null,null,{"$f":"+LEFT(VLOOKUP(D6,競漕日程,3),2)","v":{"$error":"#REF!"}},{"$f":"+VLOOKUP(D6,競漕日程,5)","v":{"$error":"#REF!"}},{"$f":"VLOOKUP(E9,E57:F60,2)","v":{"$error":"#REF!"}},{"$f":"+VLOOKUP(D6,競漕日程,6)","v":{"$error":"#REF!"}},{"$f":"+VLOOKUP(D6,競漕日程,7)","v":{"$error":"#REF!"}},"1000m",null,"上がり数"]
[]
[null,"レーン番号",null,"県名","クルー名","着順","ゴールタイム"]
[null,null,null,null,null,null,"分","秒"]
[null,1,4,{"$f":"IF(ISERROR(VLOOKUP(C13,#REF!,2,FALSE)),\"\",VLOOKUP(C13,#REF!,2,FALSE))","v":""},{"$f":"IF(ISERROR(VLOOKUP(C13,#REF!,3,FALSE)),\"\",VLOOKUP(C13,#REF!,3,FALSE))","v":""}]
[null,2,2,{"$f":"IF(ISERROR(VLOOKUP(C14,#REF!,2,FALSE)),\"\",VLOOKUP(C14,#REF!,2,FALSE))","v":""},{"$f":"IF(ISERROR(VLOOKUP(C14,#REF!,3,FALSE)),\"\",VLOOKUP(C14,#REF!,3,FALSE))","v":""}]
[null,3,1,{"$f":"IF(ISERROR(VLOOKUP(C15,#REF!,2,FALSE)),\"\",VLOOKUP(C15,#REF!,2,FALSE))","v":""},{"$f":"IF(ISERROR(VLOOKUP(C15,#REF!,3,FALSE)),\"\",VLOOKUP(C15,#REF!,3,FALSE))","v":""}]
[null,4,3,{"$f":"IF(ISERROR(VLOOKUP(C16,#REF!,2,FALSE)),\"\",VLOOKUP(C16,#REF!,2,FALSE))","v":""},{"$f":"IF(ISERROR(VLOOKUP(C16,#REF!,3,FALSE)),\"\",VLOOKUP(C16,#REF!,3,FALSE))","v":""}]
[null,null,null,null,null,null,null,null,"天候"]
[null,"備考",null,null,null,null,null,null,"風向"]
[null,null,null,null,null,null,null,null,"風速",null,null,"m/秒",null,null,null,null,null,"記録用紙印刷　　ctrl+y"]
[null,null,null,null,null,null,null,null,null,null,null,null,null,null,null,null,null,"審判用用紙印刷　ctrl+g"]
[]
[]
[]
[]
[]
[]
[]
[null,null,null,null,null,null,null,{"$f":"PHONETIC(E16)","v":""},{"$f":"PHONETIC(E15)","v":""},{"$f":"PHONETIC(E14)","v":""},{"$f":"PHONETIC(E13)","v":""}]
[]
[]
[]
[]
[]
[]
[]
[]
[]
[]
[]
[]
{"$rows_left_out":21}
{"sheet":"48","index":5,"n_rows":60,"n_cols":27,"rows_kept":60,"cut":false,"hidden":true,"merged":[[16,9,16,11],[17,9,17,11],[18,9,18,10],[10,6,10,8],[2,25,2,26],[7,24,13,24],[10,9,10,11],[3,9,4,9],[3,10,4,10],[3,11,4,11],[7,23,13,23],[7,21,13,21],[7,22,13,22],[2,20,2,23],[5,7,5,8],[7,6,7,7],[10,1,11,1],[10,3,11,3],[10,4,11,4],[10,5,11,5],[7,4,7,5]]}
[null,null,null,null,null,null,null,null,null,"No."]
[]
[null,null,"第64回東海高等学校総合体育大会ボート競技","第64回東海高等学校総合体育大会ボート競技",null,null,null,null,null,"競　漕　委員長","審判長","主　席　判定員",null,null,null,null,null,null,null,null,"東海総体",null,null,null,null,"2013-06-15"]
[null,null,"平成29年6月１7日（土）","平成29年6月18日（日）",null,null,null,null,null,null,null,null,null,null,null,null,null,null,null,null,"レースNo","発艇時刻","クラス","種目","区分",null,"上がり"]
[null,null,null,null,null,null,null,null,null,null,null,null,null,null,null,null,null,null,null,null,{"$f":"+D6","v":48},{"$f":"+H6","v":{"$error":"#REF!"}},{"$f":"+D9","v":{"$error":"#REF!"}},{"$f":"+F9","v":{"$error":"#REF!"}},{"$f":"+G9","v":{"$error":"#REF!"}},{"$f":"+H9","v":{"$error":"#REF!"}},{"$f":"+L9","v":0}]
[null,"レースNo.",null,48,null,"発艇",null,{"$f":"+VLOOKUP(D6,#REF!,2)","v":{"$error":"#REF!"}}]
[null,null,null,null,null,null,null,null,null,null,null,null,null,null,null,null,null,null,null,null,null,4,3,2,1]
[null,null,null,"参加区分","種目",null,"区分",null,"距離",null,"使用レーン数",4,null,null,null,null,null,null,null,null,null,{"$f":"IF(E16=0,\"\",E16)","v":""},{"$f":"IF(E15=0,\"\",E15)","v":""},{"$f":"IF(E14=0,\"\",E14)","v":""},{"$f":"IF(E13=0,\"\",E13)","v":""}]
[null,null,null,{"$f":"+LEFT(VLOOKUP(D6,競漕日程,3),2)","v":{"$error":"#REF!"}},{"$f":"+VLOOKUP(D6,競漕日程,5)","v":{"$error":"#REF!"}},{"$f":"VLOOKUP(E9,E57:F60,2)","v":{"$error":"#REF!"}},{"$f":"+VLOOKUP(D6,競漕日程,6)","v":{"$error":"#REF!"}},{"$f":"+VLOOKUP(D6,競漕日程,7)","v":{"$error":"#REF!"}},"1000m",null,"上がり数"]
[]
[null,"レーン番号",null,"県名","クルー名","着順","ゴールタイム"]
[null,null,null,null,null,null,"分","秒"]
[null,1,4,{"$f":"IF(ISERROR(VLOOKUP(C13,#REF!,2,FALSE)),\"\",VLOOKUP(C13,#REF!,2,FALSE))","v":""},{"$f":"IF(ISERROR(VLOOKUP(C13,#REF!,3,FALSE)),\"\",VLOOKUP(C13,#REF!,3,FALSE))","v":""}]
[null,2,2,{"$f":"IF(ISERROR(VLOOKUP(C14,#REF!,2,FALSE)),\"\",VLOOKUP(C14,#REF!,2,FALSE))","v":""},{"$f":"IF(ISERROR(VLOOKUP(C14,#REF!,3,FALSE)),\"\",VLOOKUP(C14,#REF!,3,FALSE))","v":""}]
[null,3,1,{"$f":"IF(ISERROR(VLOOKUP(C15,#REF!,2,FALSE)),\"\",VLOOKUP(C15,#REF!,2,FALSE))","v":""},{"$f":"IF(ISERROR(VLOOKUP(C15,#REF!,3,FALSE)),\"\",VLOOKUP(C15,#REF!,3,FALSE))","v":""}]
[null,4,3,{"$f":"IF(ISERROR(VLOOKUP(C16,#REF!,2,FALSE)),\"\",VLOOKUP(C16,#REF!,2,FALSE))","v":""},{"$f":"IF(ISERROR(VLOOKUP(C16,#REF!,3,FALSE)),\"\",VLOOKUP(C16,#REF!,3,FALSE))","v":""}]
[null,null,null,null,null,null,null,null,"天候"]
[null,"備考",null,null,null,null,null,null,"風向"]
[null,null,null,null,null,null,null,null,"風速",null,null,"m/秒",null,null,null,null,null,"記録用紙印刷　　ctrl+y"]
[null,null,null,null,null,null,null,null,null,null,null,null,null,null,null,null,null,"審判用用紙印刷　ctrl+g"]
[]
[]
[]
[]
[]
[]
[]
[null,null,null,null,null,null,null,{"$f":"PHONETIC(E16)","v":""},{"$f":"PHONETIC(E15)","v":""},{"$f":"PHONETIC(E14)","v":""},{"$f":"PHONETIC(E13)","v":""}]
[]
[]
[]
[]
[]
[]
[]
[]
[]
[]
[]
[]
{"$rows_left_out":21}
{"sheet":"記録","index":6,"n_rows":54,"n_cols":13,"rows_kept":54,"cut":false,"hidden":false,"merged":[[2,0,3,0],[2,12,2,13],[3,12,3,13],[1,1,3,1],[1,4,3,4],[1,5,2,7],[1,9,2,11],[1,12,1,13],[49,12,49,13],[28,12,28,13],[29,12,29,13],[32,12,32,13],[33,12,33,13],[36,12,36,13],[48,12,48,13],[37,12,37,13],[44,12,44,13],[45,12,45,13],[40,12,40,13],[41,12,41,13],[24,12,24,13],[25,12,25,13],[22,12,22,13],[23,12,23,13],[26,12,26,13],[27,12,27,13],[10,12,10,13],[11,12,11,13],[14,12,14,13],[15,12,15,13],[18,12,18,13],[17,12,17,13],[16,12,16,13],[12,12,12,13],[13,12,13,13],[5,12,5,13],[4,12,4,13],[20,12,20,13],[21,12,21,13],[19,12,19,13],[6,12,6,13],[7,12,7,13],[8,12,8,13],[9,12,9,13]]}
["第64回東海高等学校総合体育大会ボート競技　決勝記録"]
["レース番号","レーン",null,null,"着　順","ゴール　タイム",null,null,null,"500ｍ　タイム"]
["発艇時刻種目・種別",null,null,"クルー名",null,null,null,null,null,null,null,null,"備　　　考"]
[null,null,null,null,null,"分","秒",null,null,"分","秒"]
[37,1,"三重","津A・中尾",3,"1","57","24"]
["11:20:00",2,"静岡","浜松西・田口",1,"1","51","90"]
["女子シングルスカル",3,"静岡","天竜・光岡",2,"1","53","83"]
["決勝",4,"","","",0,0,0]
[38,1,"静岡","浜松北・船木",3,"1","41","37"]
["11:28:00",2,"岐阜","美濃加茂・可児",2,"1","40","48"]
["男子シングルスカル",3,"愛知","東郷・西田",1,"1","38","99"]
["決勝",4,"","","",0,0,0]
[39,1,"岐阜","恵那",3,"1","53","34"]
["11:36:00",2,"岐阜","美濃加茂",2,"1","47","96"]
["女子ダブルスカル",3,"愛知","旭丘",1,"1","46","63"]
["決勝",4,"","","",0,0,0]
[40,1,"岐阜","加茂",3,"1","34","08"]
["11:44:00",2,"愛知","豊田北Ａ",1,"1","33","23"]
["男子ダブルスカル",3,"愛知","猿投農林",2,"1","33","91"]
["決勝",4,"","","",0,0,0]
[41,1,"静岡","浜松湖南",3,"1","45","54"]
["11:52:00",2,"岐阜","加茂Ａ",1,"1","40","53"]
["女子舵手付クォドルプル",3,"愛知","猿投農林",2,"1","42","30"]
["決勝",4,"","","",0,0,0]
[42,1,"愛知","旭丘",3,"1","31","86"]
["12:00:00",2,"岐阜","八百津",1,"1","30","77"]
["男子舵手付クォドルプル",3,"静岡","浜松西",2,"1","31","05"]
["決勝",4,"","","",0,0,0]
[43,1,{"$f":"IF('43'!$F$13=0,\"\",'43'!$D$13)","v":""},{"$f":"IF('43'!$F$13=0,\"\",'43'!$E$13)","v":""},{"$f":"IF('43'!$F$13=0,\"\",'43'!$F$13)","v":""},{"$f":"+'43'!$G$13","v":0},{"$f":"+'43'!$H$13","v":0},{"$f":"+'43'!$I$13","v":0}]
[{"$f":"+'43'!$H$6","v":{"$error":"#REF!"}},2,{"$f":"IF('43'!$F$14=0,\"\",'43'!$D$14)","v":""},{"$f":"IF('43'!$F$14=0,\"\",'43'!$E$14)","v":""},{"$f":"IF('43'!$F$14=0,\"\",'43'!$F$14)","v":""},{"$f":"+'43'!$G$14","v":0},{"$f":"+'43'!$H$14","v":0},{"$f":"+'43'!$I$14","v":0}]
[{"$f":"CONCATENATE('43'!$D$9,'43'!$F$9)","v":{"$error":"#REF!"}},3,{"$f":"IF('43'!$F$15=0,\"\",'43'!$D$15)","v":""},{"$f":"IF('43'!$F$15=0,\"\",'43'!$E$15)","v":""},{"$f":"IF('43'!$F$15=0,\"\",'43'!$F$15)","v":""},{"$f":"+'43'!$G$15","v":0},{"$f":"+'43'!$H$15","v":0},{"$f":"+'43'!$I$15","v":0}]
[{"$f":"CONCATENATE('43'!$G$9,'43'!$H$9)","v":{"$error":"#REF!"}},4,{"$f":"IF('43'!$F$16=0,\"\",'43'!$D$16)","v":""},{"$f":"IF('43'!$F$16=0,\"\",'43'!$E$16)","v":""},{"$f":"IF('43'!$F$16=0,\"\",'43'!$F$16)","v":""},{"$f":"+'43'!$G$16","v":0},{"$f":"+'43'!$H$16","v":0},{"$f":"+'43'!$I$16","v":0}]
[44,1,{"$f":"IF('44'!$F$13=0,\"\",'44'!$D$13)","v":""},{"$f":"IF('44'!$F$13=0,\"\",'44'!$E$13)","v":""},{"$f":"IF('44'!$F$13=0,\"\",'44'!$F$13)","v":""},{"$f":"+'44'!$G$13","v":0},{"$f":"+'44'!$H$13","v":0},{"$f":"+'44'!$I$13","v":0}]
[{"$f":"+'44'!$H$6","v":{"$error":"#REF!"}},2,{"$f":"IF('44'!$F$14=0,\"\",'44'!$D$14)","v":""},{"$f":"IF('44'!$F$14=0,\"\",'44'!$E$14)","v":""},{"$f":"IF('44'!$F$14=0,\"\",'44'!$F$14)","v":""},{"$f":"+'44'!$G$14","v":0},{"$f":"+'44'!$H$14","v":0},{"$f":"+'44'!$I$14","v":0}]
[{"$f":"CONCATENATE('44'!$D$9,'44'!$F$9)","v":{"$error":"#REF!"}},3,{"$f":"IF('44'!$F$15=0,\"\",'44'!$D$15)","v":""},{"$f":"IF('44'!$F$15=0,\"\",'44'!$E$15)","v":""},{"$f":"IF('44'!$F$15=0,\"\",'44'!$F$15)","v":""},{"$f":"+'44'!$G$15","v":0},{"$f":"+'44'!$H$15","v":0},{"$f":"+'44'!$I$15","v":0}]
[{"$f":"CONCATENATE('44'!$G$9,'44'!$H$9)","v":{"$error":"#REF!"}},4,{"$f":"IF('44'!$F$16=0,\"\",'44'!$D$16)","v":""},{"$f":"IF('44'!$F$16=0,\"\",'44'!$E$16)","v":""},{"$f":"IF('44'!$F$16=0,\"\",'44'!$F$16)","v":""},{"$f":"+'44'!$G$16","v":0},{"$f":"+'44'!$H$16","v":0},{"$f":"+'44'!$I$16","v":0}]
[45,1,{"$f":"IF('45'!$F$13=0,\"\",'45'!$D$13)","v":""},{"$f":"IF('45'!$F$13=0,\"\",'45'!$E$13)","v":""},{"$f":"IF('45'!$F$13=0,\"\",'45'!$F$13)","v":""},{"$f":"+'45'!$G$13","v":0},{"$f":"+'45'!$H$13","v":0},{"$f":"+'45'!$I$13","v":0}]
[{"$f":"+'45'!$H$6","v":{"$error":"#REF!"}},2,{"$f":"IF('45'!$F$14=0,\"\",'45'!$D$14)","v":""},{"$f":"IF('45'!$F$14=0,\"\",'45'!$E$14)","v":""},{"$f":"IF('45'!$F$14=0,\"\",'45'!$F$14)","v":""},{"$f":"+'45'!$G$14","v":0},{"$f":"+'45'!$H$14","v":0},{"$f":"+'45'!$I$14","v":0}]
[{"$f":"CONCATENATE('45'!$D$9,'45'!$F$9)","v":{"$error":"#REF!"}},3,{"$f":"IF('45'!$F$15=0,\"\",'45'!$D$15)","v":""},{"$f":"IF('45'!$F$15=0,\"\",'45'!$E$15)","v":""},{"$f":"IF('45'!$F$15=0,\"\",'45'!$F$15)","v":""},{"$f":"+'45'!$G$15","v":0},{"$f":"+'45'!$H$15","v":0},{"$f":"+'45'!$I$15","v":0}]
[{"$f":"CONCATENATE('45'!$G$9,'45'!$H$9)","v":{"$error":"#REF!"}},4,{"$f":"IF('45'!$F$16=0,\"\",'45'!$D$16)","v":""},{"$f":"IF('45'!$F$16=0,\"\",'45'!$E$16)","v":""},{"$f":"IF('45'!$F$16=0,\"\",'45'!$F$16)","v":""},{"$f":"+'45'!$G$16","v":0},{"$f":"+'45'!$H$16","v":0},{"$f":"+'45'!$I$16","v":0}]
{"$rows_left_out":14}